Reaction Details
TargetPotassium voltage-gated channel subfamily H member 2
LigandBDBM50151862
Substrate/Competitorn/a
Meas. Tech.ChEMBL_304914 (CHEMBL827807)
IC50 6100±n/a nM
Citation Du, LPTsai, KCLi, MYYou, QDXia, L The pharmacophore hypotheses of I(Kr) potassium channel blockers: novel class III antiarrhythmic agents. Bioorg Med Chem Lett14:4771-7 (2004) 
 
Potassium voltage-gated channel subfamily H member 2
Name:Potassium voltage-gated channel subfamily H member 2
Type:Multi-pass membrane protein
Mol. Mass.:126672.65
Organism:Homo sapiens (Human)
Description:Q12809
Residue:1159
BDBM50151862
NameBDBM50151862
Synonyms:CHEMBL184014 | [2-(3,4-Dimethoxy-phenyl)-ethyl]-[2-(2,6-dimethyl-phenoxy)-1-methyl-ethyl]-amine
TypeSmall organic molecule
Emp. Form.C21H29NO3
Mol. Mass.343.4599
SMILESCOc1ccc(CCNC(C)COc2c(C)cccc2C)cc1OC