Reaction Details
TargetPotassium voltage-gated channel subfamily H member 2
LigandBDBM50099582
Substrate/Competitorn/a
Meas. Tech.ChEMBL_304914 (CHEMBL827807)
IC50 12600±n/a nM
Citation Du, LPTsai, KCLi, MYYou, QDXia, L The pharmacophore hypotheses of I(Kr) potassium channel blockers: novel class III antiarrhythmic agents. Bioorg Med Chem Lett14:4771-7 (2004) 
 
Potassium voltage-gated channel subfamily H member 2
Name:Potassium voltage-gated channel subfamily H member 2
Type:Multi-pass membrane protein
Mol. Mass.:126672.65
Organism:Homo sapiens (Human)
Description:Q12809
Residue:1159
BDBM50099582
NameBDBM50099582
Synonyms:(3R,4S)N-[3-Hydroxy-2,2-dimethyl-6-(4,4,4-trifluoro-butoxy)-chroman-4-yl]-N-methyl-methanesulfonamide N-[(3R,4S)-3-Hydroxy-2,2-dimethyl-6-(4,4,4-trifluoro-butoxy)-chroman-4-yl]-N-methyl-methanesulfonamide | N-[3-Hydroxy-2,2-dimethyl-6-(4,4,4-trifluoro-butoxy)-chroman-4-yl]-N-methyl-methanesulfonamide
TypeSmall organic molecule
Emp. Form.C17H24F3NO5S
Mol. Mass.411.436
SMILESCN([C@@H]1[C@@H](O)C(C)(C)Oc2ccc(OCCCC(F)(F)F)cc12)S(C)(=O)=O