Reaction Details
TargetPotassium voltage-gated channel subfamily H member 2
LigandBDBM50117913
Substrate/Competitorn/a
Meas. Tech.ChEMBL_304914 (CHEMBL827807)
IC50 400±n/a nM
Citation Du, LPTsai, KCLi, MYYou, QDXia, L The pharmacophore hypotheses of I(Kr) potassium channel blockers: novel class III antiarrhythmic agents. Bioorg Med Chem Lett14:4771-7 (2004) 
 
Potassium voltage-gated channel subfamily H member 2
Name:Potassium voltage-gated channel subfamily H member 2
Type:Multi-pass membrane protein
Mol. Mass.:126672.65
Organism:Homo sapiens (Human)
Description:Q12809
Residue:1159
BDBM50117913
NameBDBM50117913
Synonyms:(E)-1-((5-(4-chlorophenyl)furan-2-yl)methyleneamino)-3-(4-(4-methylpiperazin-1-yl)butyl)imidazolidine-2,4-dione 1-{[5-(4-Chloro-phenyl)-furan-2-ylmethylene]-amino}-3-[4-(4-methyl-piperazin-1-yl)-butyl]-imidazolidine-2,4-dione(Azimilide) AZIMILIDE DIHYDROCHLORIDE | CHEMBL123558
TypeSmall organic molecule
Emp. Form.C23H28ClN5O3
Mol. Mass.457.953
SMILESCN1CCN(CCCCn2c(O)cn(N=Cc3ccc(o3)-c3ccc(Cl)cc3)c2=O)CC1