Reaction Details
TargetPotassium voltage-gated channel subfamily H member 2
LigandBDBM50028893
Substrate/Competitorn/a
Meas. Tech.ChEMBL_304914 (CHEMBL827807)
IC50 12000±n/a nM
Citation Du, LPTsai, KCLi, MYYou, QDXia, L The pharmacophore hypotheses of I(Kr) potassium channel blockers: novel class III antiarrhythmic agents. Bioorg Med Chem Lett14:4771-7 (2004) 
 
Potassium voltage-gated channel subfamily H member 2
Name:Potassium voltage-gated channel subfamily H member 2
Type:Multi-pass membrane protein
Mol. Mass.:126672.65
Organism:Homo sapiens (Human)
Description:Q12809
Residue:1159
BDBM50028893
NameBDBM50028893
Synonyms:4-(diisopropylamino)-2-phenyl-2-pyridin-2-ylbutanamide DISOPYRAMIDE gamma-Diisopropylamino-alpha-phenyl-alpha-(2-pyridyl)butyramide
TypeSmall organic molecule
Emp. Form.C21H29N3O
Mol. Mass.339.4745
SMILESCC(C)N(CCC(C(N)=O)(c1ccccc1)c1ccccn1)C(C)C