Reaction Details
TargetSubstance-K receptor
LigandBDBM50129513
Substrate/Competitorn/a
Meas. Tech.ChEMBL_302769 (CHEMBL838832)
Ki 1±n/a nM
Citation Huang, SCUndem, BKorlipara, V Design and synthesis of substituted N-methylbenzamide analogues derived from SR 48,968 as neurokinin-2 receptor antagonists. Bioorg Med Chem Lett14:4779-82 (2004) 
 
Substance-K receptor
Name:Substance-K receptor
Type:PROTEIN
Mol. Mass.:43078.78
Organism:Bos taurus
Description:ChEMBL_143050
Residue:384
BDBM50129513
NameBDBM50129513
Synonyms:CHEMBL71397 | N-[2-(3,4-Dichloro-phenyl)-4-(4-hydroxy-4-phenyl-piperidin-1-yl)-butyl]-N-methyl-benzamide
TypeSmall organic molecule
Emp. Form.C29H32Cl2N2O2
Mol. Mass.511.483
SMILESCN(CC(CCN1CCC(O)(CC1)c1ccccc1)c1ccc(Cl)c(Cl)c1)C(=O)c1ccccc1