Reaction Details
TargetBeta-secretase 1
LigandBDBM50152292
Substrate/Competitorn/a
Meas. Tech.ChEMBL_302490 (CHEMBL827180)
Ki 22423±n/a nM
Citation Rajamani, RReynolds, CH Modeling the binding affinities of beta-secretase inhibitors: application to subsite specificity. Bioorg Med Chem Lett14:4843-6 (2004) 
 
Beta-secretase 1
Name:Beta-secretase 1
Type:Protein
Mol. Mass.:55755.10
Organism:Homo sapiens (Human)
Description:P56817
Residue:501
BDBM50152292
NameBDBM50152292
Synonyms:CHEMBL361667 | {3-[(S)-4-(1-Benzylcarbamoyl-ethylcarbamoyl)-2-hydroxy-1-isobutyl-pentylamino]-1-(S)-1-carbamoylmethyl-2-oxo-propyl}-carbamic acid tert-butyl ester
TypeSmall organic molecule
Emp. Form.C30H49N5O7
Mol. Mass.591.7394
SMILESCC(C)C[C@H](NCC(=O)[C@H](CC(N)=O)NC(=O)OC(C)(C)C)C(O)CC(C)C(=O)NC(C)C(=O)NCc1ccccc1