Reaction Details
TargetBeta-secretase 1
LigandBDBM50152293
Substrate/Competitorn/a
Meas. Tech.ChEMBL_302490 (CHEMBL827180)
Ki 3134±n/a nM
Citation Rajamani, RReynolds, CH Modeling the binding affinities of beta-secretase inhibitors: application to subsite specificity. Bioorg Med Chem Lett14:4843-6 (2004) 
 
Beta-secretase 1
Name:Beta-secretase 1
Type:Protein
Mol. Mass.:55755.10
Organism:Homo sapiens (Human)
Description:P56817
Residue:501
BDBM50152293
NameBDBM50152293
Synonyms:CHEMBL360828 | {3-[(S)-4-(1-Benzylcarbamoyl-2-methyl-propylcarbamoyl)-2-hydroxy-1-isobutyl-pentylamino]-1-(S)-1-carbamoylmethyl-2-oxo-propyl}-carbamic acid tert-butyl ester
TypeSmall organic molecule
Emp. Form.C32H53N5O7
Mol. Mass.619.7925
SMILESCC(C)C[C@H](NCC(=O)[C@H](CC(N)=O)NC(=O)OC(C)(C)C)C(O)CC(C)C(=O)NC(C(C)C)C(=O)NCc1ccccc1