Reaction Details
TargetBeta-secretase 1
LigandBDBM50128032
Substrate/Competitorn/a
Meas. Tech.ChEMBL_302490 (CHEMBL827180)
Ki 50±n/a nM
Citation Rajamani, RReynolds, CH Modeling the binding affinities of beta-secretase inhibitors: application to subsite specificity. Bioorg Med Chem Lett14:4843-6 (2004) 
 
Beta-secretase 1
Name:Beta-secretase 1
Type:Protein
Mol. Mass.:55755.10
Organism:Homo sapiens (Human)
Description:P56817
Residue:501
BDBM50128032
NameBDBM50128032
Synonyms:((S)-1-{1-[(S)-4-(1-Benzylcarbamoyl-2-methyl-propylcarbamoyl)-2-hydroxy-1-isobutyl-pentylcarbamoyl]-2-methylsulfanyl-ethylcarbamoyl}-2-methyl-propyl)-carbamic acid tert-butyl ester CHEMBL65752
TypeSmall organic molecule
Emp. Form.C36H61N5O7S
Mol. Mass.707.964
SMILESCSCC(NC(=O)[C@@H](NC(=O)OC(C)(C)C)C(C)C)C(=O)N[C@@H](CC(C)C)C(O)CC(C)C(=O)NC(C(C)C)C(=O)NCc1ccccc1