Reaction Details
TargetAdenosine receptor A1
LigandBDBM21221
Substrate/Competitorn/a
Meas. Tech.ChEMBL_303374 (CHEMBL839692)
Ki 222±n/a nM
Citation Jeong, LSKim, MJKim, HOGao, ZGKim, SKJacobson, KAChun, MW Design and synthesis of 3'-ureidoadenosine-5'-uronamides: effects of the 3'-ureido group on binding to the A3 adenosine receptor. Bioorg Med Chem Lett14:4851-4 (2004) 
 
Adenosine receptor A1
Name:Adenosine receptor A1
Type:G Protein-Coupled Receptor (GPCR)
Mol. Mass.:36520.92
Organism:Homo sapiens (Human)
Description:P30542
Residue:326
BDBM21221
NameBDBM21221
Synonyms:(2S,3S,4R,5R)-5-(2-chloro-6-{[(3-iodophenyl)methyl]amino}-9H-purin-9-yl)-3,4-dihydroxy-N-methyloxolane-2-carboxamide 2-chloro-N6-(3-iodobenzyl)adenosine-5-N-methylcarboxamide C1-IB-MECA CI-IB-MECA US20230364057, Compound 76
TypeSmall organic molecule
Emp. Form.C18H18ClIN6O4
Mol. Mass.544.731
SMILESCNC(=O)[C@H]1O[C@H]([C@H](O)[C@@H]1O)n1cnc2c(NCc3cccc(I)c3)nc(Cl)nc12