Reaction Details
TargetSphingosine 1-phosphate receptor 5
LigandBDBM50152540
Substrate/Competitorn/a
Meas. Tech.ChEMBL_304459 (CHEMBL832507)
EC50 370±n/a nM
Citation Clemens, JJDavis, MDLynch, KRMacdonald, TL Synthesis of benzimidazole based analogues of sphingosine-1-phosphate: discovery of potent, subtype-selective S1P4 receptor agonists. Bioorg Med Chem Lett14:4903-6 (2004) 
 
Sphingosine 1-phosphate receptor 5
Name:Sphingosine 1-phosphate receptor 5
Type:G Protein-Coupled Receptor (GPCR)
Mol. Mass.:41796.42
Organism:Homo sapiens (Human)
Description:n/a
Residue:398
BDBM50152540
NameBDBM50152540
Synonyms:CHEMBL433593 | Phosphoric acid mono-[2-amino-2-(6-octyl-1H-benzoimidazol-2-yl)-propyl] ester; TFA
TypeSmall organic molecule
Emp. Form.C18H30N3O4P
Mol. Mass.383.4223
SMILESCCCCCCCCc1ccc2nc([nH]c2c1)C(C)(N)COP(O)(O)=O