Reaction Details
TargetSphingosine 1-phosphate receptor 1
LigandBDBM50152541
Substrate/Competitorn/a
Meas. Tech.ChEMBL_304458 (CHEMBL832506)
EC50 2100±n/a nM
Citation Clemens, JJDavis, MDLynch, KRMacdonald, TL Synthesis of benzimidazole based analogues of sphingosine-1-phosphate: discovery of potent, subtype-selective S1P4 receptor agonists. Bioorg Med Chem Lett14:4903-6 (2004) 
 
Sphingosine 1-phosphate receptor 1
Name:Sphingosine 1-phosphate receptor 1
Type:Enzyme
Mol. Mass.:42836.02
Organism:Homo sapiens (Human)
Description:P21453
Residue:382
BDBM50152541
NameBDBM50152541
Synonyms:(R)-2-Amino-2-(6-octyl-1H-benzoimidazol-2-yl)-ethanol; TFA | CHEMBL363076
TypeSmall organic molecule
Emp. Form.C17H27N3O
Mol. Mass.289.4158
SMILESCCCCCCCCc1ccc2nc([nH]c2c1)[C@@H](N)CO