Reaction Details
TargetSphingosine 1-phosphate receptor 3
LigandBDBM50158348
Substrate/Competitorn/a
Meas. Tech.ChEMBL_304396 (CHEMBL830046)
EC50 1.2±n/a nM
Citation Clemens, JJDavis, MDLynch, KRMacdonald, TL Synthesis of benzimidazole based analogues of sphingosine-1-phosphate: discovery of potent, subtype-selective S1P4 receptor agonists. Bioorg Med Chem Lett14:4903-6 (2004) 
 
Sphingosine 1-phosphate receptor 3
Name:Sphingosine 1-phosphate receptor 3
Type:G Protein-Coupled Receptor (GPCR)
Mol. Mass.:42278.13
Organism:Homo sapiens (Human)
Description:Q99500
Residue:378
BDBM50158348
NameBDBM50158348
Synonyms:(2S,3R,4E)-2-amino-3-hydroxyoctadec-4-en-1-yl dihydrogen phosphate CHEMBL225155 US11584726, Example S1P sphingosine-1-phosphate
TypeSmall organic molecule
Emp. Form.C18H38NO5P
Mol. Mass.379.4718
SMILESCCCCCCCCCCCCC\C=C\[C@@H](O)[C@@H](N)COP(O)(O)=O