Reaction Details
TargetAndrogen receptor
LigandBDBM50153636
Substrate/Competitorn/a
Meas. Tech.ChEMBL_303025 (CHEMBL830413)
Ki 639±n/a nM
Citation Van Dort, MEJung, YW Synthesis and structure-activity investigation of iodinated arylhydantoins and arylthiohydantoins for development as androgen receptor radioligands. Bioorg Med Chem Lett14:5285-8 (2004) 
 
Androgen receptor
Name:Androgen receptor
Type:Enzyme
Mol. Mass.:98219.08
Organism:Rattus norvegicus (Rat)
Description:P15207
Residue:902
BDBM50153636
NameBDBM50153636
Synonyms:4-[4,4-Dimethyl-2,5-dioxo-3-(3-phenyl-propyl)-imidazolidin-1-yl]-2-iodo-benzonitrile | CHEMBL440563
TypeSmall organic molecule
Emp. Form.C21H20IN3O2
Mol. Mass.473.3069
SMILESCC1(C)N(CCCc2ccccc2)C(=O)N(C1=O)c1ccc(C#N)c(I)c1