Reaction Details
TargetAndrogen receptor
LigandBDBM50153638
Substrate/Competitorn/a
Meas. Tech.ChEMBL_303025 (CHEMBL830413)
Ki 219±n/a nM
Citation Van Dort, MEJung, YW Synthesis and structure-activity investigation of iodinated arylhydantoins and arylthiohydantoins for development as androgen receptor radioligands. Bioorg Med Chem Lett14:5285-8 (2004) 
 
Androgen receptor
Name:Androgen receptor
Type:Enzyme
Mol. Mass.:98219.08
Organism:Rattus norvegicus (Rat)
Description:P15207
Residue:902
BDBM50153638
NameBDBM50153638
Synonyms:4-(3-Benzyl-4,4-dimethyl-5-oxo-2-thioxo-imidazolidin-1-yl)-2-iodo-benzonitrile | CHEMBL184833
TypeSmall organic molecule
Emp. Form.C19H16IN3OS
Mol. Mass.461.319
SMILESCC1(C)N(Cc2ccccc2)C(=S)N(C1=O)c1ccc(C#N)c(I)c1