Reaction Details
TargetAndrogen receptor
LigandBDBM50153641
Substrate/Competitorn/a
Meas. Tech.ChEMBL_303025 (CHEMBL830413)
Ki 11±n/a nM
Citation Van Dort, MEJung, YW Synthesis and structure-activity investigation of iodinated arylhydantoins and arylthiohydantoins for development as androgen receptor radioligands. Bioorg Med Chem Lett14:5285-8 (2004) 
 
Androgen receptor
Name:Androgen receptor
Type:Enzyme
Mol. Mass.:98219.08
Organism:Rattus norvegicus (Rat)
Description:P15207
Residue:902
BDBM50153641
NameBDBM50153641
Synonyms:2-Iodo-4-(3,4,4-trimethyl-2,5-dioxo-imidazolidin-1-yl)-benzonitrile | CHEMBL184759
TypeSmall organic molecule
Emp. Form.C13H12IN3O2
Mol. Mass.369.1578
SMILESCN1C(=O)N(C(=O)C1(C)C)c1ccc(C#N)c(I)c1