Reaction Details
Target1-deoxy-D-xylulose 5-phosphate reductoisomerase
LigandBDBM50153713
Substrate/Competitorn/a
Meas. Tech.ChEMBL_302829 (CHEMBL838619)
Ki 21±n/a nM
Citation Phaosiri, CProteau, PJ Substrate analogs for the investigation of deoxyxylulose 5-phosphate reductoisomerase inhibition: synthesis and evaluation. Bioorg Med Chem Lett14:5309-12 (2004) 
 
1-deoxy-D-xylulose 5-phosphate reductoisomerase
Name:1-deoxy-D-xylulose 5-phosphate reductoisomerase
Type:PROTEIN
Mol. Mass.:42517.94
Organism:Synechocystis sp. (strain PCC 6803)
Description:ChEMBL_303054
Residue:394
BDBM50153713
NameBDBM50153713
Synonyms:3-(N-hydroxyformamido)propylphosphonic acid CHEMBL203125 fosmidomycin
TypeSmall organic molecule
Emp. Form.C4H10NO5P
Mol. Mass.183.0997
SMILESON(CCCP(O)(O)=O)C=O