Reaction Details
Target1-deoxy-D-xylulose 5-phosphate reductoisomerase
LigandBDBM50153714
Substrate/Competitorn/a
Meas. Tech.ChEMBL_303054 (CHEMBL828880)
Ki 150000±n/a nM
Citation Phaosiri, CProteau, PJ Substrate analogs for the investigation of deoxyxylulose 5-phosphate reductoisomerase inhibition: synthesis and evaluation. Bioorg Med Chem Lett14:5309-12 (2004) 
 
1-deoxy-D-xylulose 5-phosphate reductoisomerase
Name:1-deoxy-D-xylulose 5-phosphate reductoisomerase
Type:PROTEIN
Mol. Mass.:42517.94
Organism:Synechocystis sp. (strain PCC 6803)
Description:ChEMBL_303054
Residue:394
BDBM50153714
NameBDBM50153714
Synonyms:4S-hydroxypentan-2-one 5-phosphate
TypeSmall organic molecule
Emp. Form.C5H9O6P
Mol. Mass.196.0962
SMILESCC(=O)C[C@H](O)COP([O-])([O-])=O