Reaction Details
TargetCarbonic anhydrase 13
LigandBDBM26979
Substrate/Competitorn/a
Meas. Tech.ChEMBL_302947 (CHEMBL841782)
Ki 138000000±n/a nM
Citation Innocenti, ALehtonen, JMParkkila, SScozzafava, ASupuran, CT Carbonic anhydrase inhibitors. Inhibition of the newly isolated murine isozyme XIII with anions. Bioorg Med Chem Lett14:5435-9 (2004) 
 
Carbonic anhydrase 13
Name:Carbonic anhydrase 13
Type:Enzyme
Mol. Mass.:29522.80
Organism:Mus musculus (mouse)
Description:Murine cloned isozyme
Residue:262
BDBM26979
NameBDBM26979
Synonyms:CHEMBL69710 POTASSIUM CHLORIDE chloride | chloride ion
TypeIon
Emp. Form.Cl
Mol. Mass.35.454
SMILES[Cl-]