Reaction Details
TargetCarbonic anhydrase 1
LigandBDBM26978
Substrate/Competitorn/a
Meas. Tech.ChEMBL_302607 (CHEMBL839657)
Ki>300000000±n/a nM
Citation Innocenti, AFirnges, MAAntel, JWurl, MScozzafava, ASupuran, CT Carbonic anhydrase inhibitors: inhibition of the membrane-bound human isozyme IV with anions. Bioorg Med Chem Lett14:5769-73 (2004) 
 
Carbonic anhydrase 1
Name:Carbonic anhydrase 1
Type:Enzyme
Mol. Mass.:28873.37
Organism:Homo sapiens (Human)
Description:P00915
Residue:261
BDBM26978
NameBDBM26978
Synonyms:BDBM50098540 CHEMBL1644027 fluoride | fluoride ion
TypeIon
Emp. Form.F
Mol. Mass.18.9989518
SMILES[F-]