Reaction Details
TargetCarbonic anhydrase
LigandBDBM10864
Substrate/Competitorn/a
Meas. Tech.ChEMBL_303240 (CHEMBL827205)
Ki 1720±n/a nM
Citation Zimmerman, SInnocenti, ACasini, AFerry, JGScozzafava, ASupuran, CT Carbonic anhydrase inhibitors. Inhibition of the prokariotic beta and gamma-class enzymes from Archaea with sulfonamides. Bioorg Med Chem Lett14:6001-6 (2004) 
 
Carbonic anhydrase
Name:Carbonic anhydrase
Type:Protein
Mol. Mass.:26390.56
Organism:Methanosarcina thermophila
Description:P40881
Residue:247
BDBM10864
NameBDBM10864
Synonyms:4-Amino-3-bromobenzenesulfonamide CHEMBL6724 halogenosulfanilamide deriv. 5d
TypeSmall organic molecule
Emp. Form.C6H7BrN2O2S
Mol. Mass.251.101
SMILESNc1ccc(cc1Br)S(N)(=O)=O