Reaction Details
TargetKappa-type opioid receptor
LigandBDBM50166729
Substrate/Competitorn/a
Meas. Tech.ChEMBL_303392 (CHEMBL839963)
Ki 7.2±n/a nM
Citation Béguin, CRichards, MRWang, YChen, YLiu-Chen, LYMa, ZLee, DYCarlezon, WACohen, BM Synthesis and in vitro pharmacological evaluation of salvinorin A analogues modified at C(2). Bioorg Med Chem Lett15:2761-5 (2005) 
 
Kappa-type opioid receptor
Name:Kappa-type opioid receptor
Type:G Protein-Coupled Receptor (GPCR)
Mol. Mass.:42648.76
Organism:Homo sapiens (Human)
Description:P41145
Residue:380
BDBM50166729
NameBDBM50166729
Synonyms:(3S,4aR,6S,8R,8aR)-3-Furan-3-yl-4a,8a-dimethyl-1,5-dioxo-6-propionyloxy-dodecahydro-2-oxa-phenanthrene-8-carboxylic acid methyl ester | CHEMBL196789
TypeSmall organic molecule
Emp. Form.C24H30O8
Mol. Mass.446.4902
SMILESCCC(=O)O[C@H]1C[C@@H](C(=O)OC)[C@]2(C)CCC3C(=O)O[C@@H](C[C@]3(C)C2C1=O)c1ccoc1