Reaction Details
TargetKappa-type opioid receptor
LigandBDBM50166720
Substrate/Competitorn/a
Meas. Tech.ChEMBL_303392 (CHEMBL839963)
Ki 155±n/a nM
Citation Béguin, CRichards, MRWang, YChen, YLiu-Chen, LYMa, ZLee, DYCarlezon, WACohen, BM Synthesis and in vitro pharmacological evaluation of salvinorin A analogues modified at C(2). Bioorg Med Chem Lett15:2761-5 (2005) 
 
Kappa-type opioid receptor
Name:Kappa-type opioid receptor
Type:G Protein-Coupled Receptor (GPCR)
Mol. Mass.:42648.76
Organism:Homo sapiens (Human)
Description:P41145
Residue:380
BDBM50166720
NameBDBM50166720
Synonyms:(3S,4aR,6S,8R,8aR)-3-Furan-3-yl-6-hydroxy-4a,8a-dimethyl-1,5-dioxo-dodecahydro-2-oxa-phenanthrene-8-carboxylic acid methyl ester | CHEMBL194982
TypeSmall organic molecule
Emp. Form.C21H26O7
Mol. Mass.390.4269
SMILESCOC(=O)[C@@H]1C[C@H](O)C(=O)C2[C@@]1(C)CCC1C(=O)O[C@@H](C[C@]21C)c1ccoc1