Reaction Details
TargetProthrombin
LigandBDBM50292183
Substrate/Competitorn/a
Meas. Tech.ChEMBL_302401 (CHEMBL829646)
Ki 18±n/a nM
Citation Nantermet, PGBurgey, CSRobinson, KAPellicore, JMNewton, CLDeng, JZSelnick, HGLewis, SDLucas, BJKrueger, JAMiller-Stein, CWhite, RBWong, BMcMasters, DRWallace, AALynch, JJYan, YChen, ZKuo, LGardell, SJShafer, JAVacca, JPLyle, TA P2 pyridine N-oxide thrombin inhibitors: a novel peptidomimetic scaffold. Bioorg Med Chem Lett15:2771-5 (2005) 
 
Prothrombin
Name:Prothrombin
Type:Protein
Mol. Mass.:70029.57
Organism:Homo sapiens (Human)
Description:P00734
Residue:622
BDBM50292183
NameBDBM50292183
Synonyms:2-(6-Amino-3-cyano-1-oxy-pyridin-2-yl)-N-(5-chloro-2-tetrazol-1-yl-benzyl)-acetamide | CHEMBL193500
TypeSmall organic molecule
Emp. Form.C16H15ClN8O2
Mol. Mass.386.796
SMILESON1C(=N)CCC(C#N)=C1CC(=O)NCc1cc(Cl)ccc1-n1cnnn1