Reaction Details
TargetProthrombin
LigandBDBM50123494
Substrate/Competitorn/a
Meas. Tech.ChEMBL_302401 (CHEMBL829646)
Ki 5.2±n/a nM
Citation Nantermet, PGBurgey, CSRobinson, KAPellicore, JMNewton, CLDeng, JZSelnick, HGLewis, SDLucas, BJKrueger, JAMiller-Stein, CWhite, RBWong, BMcMasters, DRWallace, AALynch, JJYan, YChen, ZKuo, LGardell, SJShafer, JAVacca, JPLyle, TA P2 pyridine N-oxide thrombin inhibitors: a novel peptidomimetic scaffold. Bioorg Med Chem Lett15:2771-5 (2005) 
 
Prothrombin
Name:Prothrombin
Type:Protein
Mol. Mass.:70029.57
Organism:Homo sapiens (Human)
Description:P00734
Residue:622
BDBM50123494
NameBDBM50123494
Synonyms:2-[6-Chloro-3-(2,2-difluoro-2-pyridin-2-yl-ethylamino)-2-oxo-2H-pyrazin-1-yl]-N-(3-fluoro-pyridin-2-ylmethyl)-acetamide | CHEMBL30054
TypeSmall organic molecule
Emp. Form.C19H16ClF3N6O2
Mol. Mass.452.818
SMILESFc1cccnc1CNC(=O)Cn1c(Cl)cnc(NCC(F)(F)c2ccccn2)c1=O