Reaction Details
TargetProthrombin
LigandBDBM50292193
Substrate/Competitorn/a
Meas. Tech.ChEMBL_302401 (CHEMBL829646)
Ki 26±n/a nM
Citation Nantermet, PGBurgey, CSRobinson, KAPellicore, JMNewton, CLDeng, JZSelnick, HGLewis, SDLucas, BJKrueger, JAMiller-Stein, CWhite, RBWong, BMcMasters, DRWallace, AALynch, JJYan, YChen, ZKuo, LGardell, SJShafer, JAVacca, JPLyle, TA P2 pyridine N-oxide thrombin inhibitors: a novel peptidomimetic scaffold. Bioorg Med Chem Lett15:2771-5 (2005) 
 
Prothrombin
Name:Prothrombin
Type:Protein
Mol. Mass.:70029.57
Organism:Homo sapiens (Human)
Description:P00734
Residue:622
BDBM50292193
NameBDBM50292193
Synonyms:2-(6-Amino-3-chloro-1-oxy-pyridin-2-yl)-N-(2-aminomethyl-5-chloro-benzyl)-acetamide | CHEMBL194060
TypeSmall organic molecule
Emp. Form.C15H16Cl2N4O2
Mol. Mass.355.219
SMILESNCc1ccc(Cl)cc1CNC(=O)Cc1c(Cl)ccc(N)[n+]1[O-]