Reaction Details
TargetProthrombin
LigandBDBM50292198
Substrate/Competitorn/a
Meas. Tech.ChEMBL_302401 (CHEMBL829646)
Ki 10±n/a nM
Citation Nantermet, PGBurgey, CSRobinson, KAPellicore, JMNewton, CLDeng, JZSelnick, HGLewis, SDLucas, BJKrueger, JAMiller-Stein, CWhite, RBWong, BMcMasters, DRWallace, AALynch, JJYan, YChen, ZKuo, LGardell, SJShafer, JAVacca, JPLyle, TA P2 pyridine N-oxide thrombin inhibitors: a novel peptidomimetic scaffold. Bioorg Med Chem Lett15:2771-5 (2005) 
 
Prothrombin
Name:Prothrombin
Type:Protein
Mol. Mass.:70029.57
Organism:Homo sapiens (Human)
Description:P00734
Residue:622
BDBM50292198
NameBDBM50292198
Synonyms:2-(6-Amino-3-cyano-1-oxy-pyridin-2-yl)-N-(2-aminomethyl-5-chloro-benzyl)-acetamide | CHEMBL196178
TypeSmall organic molecule
Emp. Form.C16H16ClN5O2
Mol. Mass.345.784
SMILESNCc1ccc(Cl)cc1CNC(=O)Cc1c(ccc(N)[n+]1[O-])C#N