Reaction Details
Target5-hydroxytryptamine receptor 6
LigandBDBM50169600
Substrate/Competitorn/a
Meas. Tech.ChEMBL_302678 (CHEMBL839441)
Ki 640±n/a nM
Citation Abate, CKolanos, RDukat, MSetola, VRoth, BLGlennon, RA Interaction of chiral MS-245 analogs at h5-HT6 receptors. Bioorg Med Chem Lett15:3510-3 (2005) 
 
5-hydroxytryptamine receptor 6
Name:5-hydroxytryptamine receptor 6
Type:G Protein-Coupled Receptor (GPCR)
Mol. Mass.:46968.43
Organism:Homo sapiens (Human)
Description:P50406
Residue:440
BDBM50169600
NameBDBM50169600
Synonyms:3-((R)-1-Methyl-pyrrolidin-2-ylmethyl)-1H-indole; hydrochloride | CHEMBL539327
TypeSmall organic molecule
Emp. Form.C14H18N2
Mol. Mass.214.3061
SMILESCN1CCC[C@@H]1Cc1c[nH]c2ccccc12