Reaction Details
TargetSphingosine 1-phosphate receptor 1
LigandBDBM50169454
Substrate/Competitorn/a
Meas. Tech.ChEMBL_304296 (CHEMBL830091)
EC50 6.4±n/a nM
Citation Clemens, JJDavis, MDLynch, KRMacdonald, TL Synthesis of 4(5)-phenylimidazole-based analogues of sphingosine-1-phosphate and FTY720: discovery of potent S1P1 receptor agonists. Bioorg Med Chem Lett15:3568-72 (2005) 
 
Sphingosine 1-phosphate receptor 1
Name:Sphingosine 1-phosphate receptor 1
Type:Enzyme
Mol. Mass.:42836.02
Organism:Homo sapiens (Human)
Description:P21453
Residue:382
BDBM50169454
NameBDBM50169454
Synonyms:CHEMBL188826 | Thiophosphoric acid (R)-2-amino-2-[5-(4-octyl-phenyl)-1H-imidazol-2-yl]-ethyl ester; TFA
TypeSmall organic molecule
Emp. Form.C19H30N3O3PS
Mol. Mass.411.499
SMILESCCCCCCCCc1ccc(cc1)-c1c[nH]c(n1)[C@@H](N)COP(O)(O)=S