Reaction Details
TargetSphingosine 1-phosphate receptor 2
LigandBDBM50169455
Substrate/Competitorn/a
Meas. Tech.ChEMBL_304306 (CHEMBL830101)
EC50 18±n/a nM
Citation Clemens, JJDavis, MDLynch, KRMacdonald, TL Synthesis of 4(5)-phenylimidazole-based analogues of sphingosine-1-phosphate and FTY720: discovery of potent S1P1 receptor agonists. Bioorg Med Chem Lett15:3568-72 (2005) 
 
Sphingosine 1-phosphate receptor 2
Name:Sphingosine 1-phosphate receptor 2
Type:G Protein-Coupled Receptor (GPCR)
Mol. Mass.:38883.16
Organism:Homo sapiens (Human)
Description:Membranes isolated from S1P2-transfected CHO cells were used in ligand binding assay.
Residue:353
BDBM50169455
NameBDBM50169455
Synonyms:CHEMBL537849 | Phosphoric acid mono-{2-amino-3-hydroxy-2-[5-(4-octyl-phenyl)-1H-imidazol-2-yl]-propyl} ester; hydrochloride
TypeSmall organic molecule
Emp. Form.C20H32N3O5P
Mol. Mass.425.4589
SMILESCCCCCCCCc1ccc(cc1)-c1c[nH]c(n1)C(N)(CO)COP(O)(O)=O