Reaction Details
TargetSphingosine 1-phosphate receptor 3
LigandBDBM50169459
Substrate/Competitorn/a
Meas. Tech.ChEMBL_304307 (CHEMBL830102)
EC50 790±n/a nM
Citation Clemens, JJDavis, MDLynch, KRMacdonald, TL Synthesis of 4(5)-phenylimidazole-based analogues of sphingosine-1-phosphate and FTY720: discovery of potent S1P1 receptor agonists. Bioorg Med Chem Lett15:3568-72 (2005) 
 
Sphingosine 1-phosphate receptor 3
Name:Sphingosine 1-phosphate receptor 3
Type:G Protein-Coupled Receptor (GPCR)
Mol. Mass.:42278.13
Organism:Homo sapiens (Human)
Description:Q99500
Residue:378
BDBM50169459
NameBDBM50169459
Synonyms:CHEMBL541890 | Thiophosphoric acid O-{2-amino-3-hydroxy-2-[5-(4-octyl-phenyl)-1H-imidazol-2-yl]-propyl} ester; hydrochloride
TypeSmall organic molecule
Emp. Form.C20H32N3O4PS
Mol. Mass.441.525
SMILESCCCCCCCCc1ccc(cc1)-c1c[nH]c(n1)C(N)(CO)COP(O)(O)=S