Reaction Details
TargetKappa-type opioid receptor
LigandBDBM50169779
Substrate/Competitorn/a
Meas. Tech.ChEMBL_302641 (CHEMBL876690)
Ki>1000±n/a nM
Citation Lee, DYKarnati, VVHe, MLiu-Chen, LYKondaveti, LMa, ZWang, YChen, YBeguin, CCarlezon, WACohen, B Synthesis and in vitro pharmacological studies of new C(2) modified salvinorin A analogues. Bioorg Med Chem Lett15:3744-7 (2005) 
 
Kappa-type opioid receptor
Name:Kappa-type opioid receptor
Type:G Protein-Coupled Receptor (GPCR)
Mol. Mass.:42648.76
Organism:Homo sapiens (Human)
Description:P41145
Residue:380
BDBM50169779
NameBDBM50169779
Synonyms:(3S,4aR,6S,8R,8aR,10aR)-3-Furan-3-yl-4a,8a-dimethyl-1,5-dioxo-6-(2,2,2-trifluoro-acetoxy)-dodecahydro-2-oxa-phenanthrene-8-carboxylic acid methyl ester | CHEMBL368887
TypeSmall organic molecule
Emp. Form.C23H25F3O8
Mol. Mass.486.435
SMILESCOC(=O)[C@@H]1C[C@H](OC(=O)C(F)(F)F)C(=O)C2[C@@]1(C)CC[C@H]1C(=O)O[C@@H](C[C@]21C)c1ccoc1