Reaction Details
TargetCarbonic anhydrase 14
LigandBDBM10872
Substrate/Competitorn/a
Meas. Tech.ChEMBL_303797 (CHEMBL829846)
Ki 76±n/a nM
Citation Nishimori, IVullo, DInnocenti, AScozzafava, AMastrolorenzo, ASupuran, CT Carbonic anhydrase inhibitors: inhibition of the transmembrane isozyme XIV with sulfonamides. Bioorg Med Chem Lett15:3828-33 (2005) 
 
Carbonic anhydrase 14
Name:Carbonic anhydrase 14
Type:Enzyme
Mol. Mass.:37665.67
Organism:Homo sapiens (Human)
Description:Human (cloned) isozyme.
Residue:337
BDBM10872
NameBDBM10872
Synonyms:4-amino-N-[2-(4-sulfamoylphenyl)ethyl]benzene-1-sulfonamide aromatic/heteroaromatic sulfonamide 17
TypeSmall organic molecule
Emp. Form.C14H17N3O4S2
Mol. Mass.355.432
SMILESNc1ccc(cc1)S(=O)(=O)NCCc1ccc(cc1)S(N)(=O)=O