Reaction Details
TargetCarbonic anhydrase 14
LigandBDBM10868
Substrate/Competitorn/a
Meas. Tech.ChEMBL_303797 (CHEMBL829846)
Ki 280±n/a nM
Citation Nishimori, IVullo, DInnocenti, AScozzafava, AMastrolorenzo, ASupuran, CT Carbonic anhydrase inhibitors: inhibition of the transmembrane isozyme XIV with sulfonamides. Bioorg Med Chem Lett15:3828-33 (2005) 
 
Carbonic anhydrase 14
Name:Carbonic anhydrase 14
Type:Enzyme
Mol. Mass.:37665.67
Organism:Homo sapiens (Human)
Description:Human (cloned) isozyme.
Residue:337
BDBM10868
NameBDBM10868
Synonyms:1,3,4-Thiadiazole-2-sulfonamide, 6 5-Amino-1,3,4-thiadiazole-2-sulphonamide (1) CHEMBL265674 | aromatic/heteroaromatic sulfonamide 13
TypeSmall organic molecule
Emp. Form.C2H4N4O2S2
Mol. Mass.180.209
SMILESNc1nnc(s1)S(N)(=O)=O