Reaction Details
TargetCarbonic anhydrase 2
LigandBDBM50157950
Substrate/Competitorn/a
Meas. Tech.ChEMBL_303334 (CHEMBL840150)
Ki 1.9±n/a nM
Citation Turkmen, HDurgun, MYilmaztekin, SEmul, MInnocenti, AVullo, DScozzafava, ASupuran, CT Carbonic anhydrase inhibitors. Novel sulfanilamide/acetazolamide derivatives obtained by the tail approach and their interaction with the cytosolic isozymes I and II, and the tumor-associated isozyme IX. Bioorg Med Chem Lett15:367-72 (2004) 
 
Carbonic anhydrase 2
Name:Carbonic anhydrase 2
Type:Enzyme
Mol. Mass.:29250.71
Organism:Homo sapiens (Human)
Description:P00918
Residue:260
BDBM50157950
NameBDBM50157950
Synonyms:3-(4-Methyl-piperazin-1-yl)-N-(5-sulfamoyl-[1,3,4]thiadiazol-2-yl)-propionamide | CHEMBL360097
TypeSmall organic molecule
Emp. Form.C10H18N6O3S2
Mol. Mass.334.418
SMILESCN1CCN(CCC(=O)Nc2nnc(s2)S(N)(=O)=O)CC1