Reaction Details
TargetCarbonic anhydrase 5A, mitochondrial
LigandBDBM36131
Substrate/Competitorn/a
Meas. Tech.ChEMBL_302505 (CHEMBL828221)
Ki 13600000±n/a nM
Citation Innocenti, AVullo, DScozzafava, ASupuran, CT Carbonic anhydrase inhibitors. Inhibition of isozymes I, II, IV, V, and IX with anions isosteric and isoelectronic with sulfate, nitrate, and carbonate. Bioorg Med Chem Lett15:567-71 (2005) 
 
Carbonic anhydrase 5A, mitochondrial
Name:Carbonic anhydrase 5A, mitochondrial
Type:Enzyme
Mol. Mass.:34755.54
Organism:Homo sapiens (Human)
Description:Human (cloned) isozyme
Residue:305
BDBM36131
NameBDBM36131
Synonyms:perchlorate | sodium perchlorate
TypeGuest
Emp. Form.ClO4
Mol. Mass.99.451
SMILES[O-][Cl](=O)(=O)=O