Reaction Details
TargetCarbonic anhydrase 1
LigandBDBM50152970
Substrate/Competitorn/a
Meas. Tech.ChEMBL_302504 (CHEMBL828220)
Ki 7000000±n/a nM
Citation Innocenti, AVullo, DScozzafava, ASupuran, CT Carbonic anhydrase inhibitors. Inhibition of isozymes I, II, IV, V, and IX with anions isosteric and isoelectronic with sulfate, nitrate, and carbonate. Bioorg Med Chem Lett15:567-71 (2005) 
 
Carbonic anhydrase 1
Name:Carbonic anhydrase 1
Type:Enzyme
Mol. Mass.:28873.37
Organism:Homo sapiens (Human)
Description:P00915
Residue:261
BDBM50152970
NameBDBM50152970
Synonyms:CHEMBL1352 nitric acid
TypeSmall organic molecule
Emp. Form.HNO3
Mol. Mass.63.0128
SMILESO[N+]([O-])=O