Reaction Details
TargetCarbonic anhydrase 2
LigandBDBM26995
Substrate/Competitorn/a
Meas. Tech.ChEMBL_302534 (CHEMBL827386)
Ki 1130000±n/a nM
Citation Innocenti, AVullo, DScozzafava, ASupuran, CT Carbonic anhydrase inhibitors. Inhibition of isozymes I, II, IV, V, and IX with anions isosteric and isoelectronic with sulfate, nitrate, and carbonate. Bioorg Med Chem Lett15:567-71 (2005) 
 
Carbonic anhydrase 2
Name:Carbonic anhydrase 2
Type:Enzyme
Mol. Mass.:29250.71
Organism:Homo sapiens (Human)
Description:P00918
Residue:260
BDBM26995
NameBDBM26995
Synonyms:CHEMBL355001 sulfamamide sulfamoylamine
Typen/a
Emp. Form.H4N2O2S
Mol. Mass.96.109
SMILESNS(N)(=O)=O