Reaction Details
TargetCarbonic anhydrase 4
LigandBDBM26986
Substrate/Competitorn/a
Meas. Tech.ChEMBL_302535 (CHEMBL827387)
Ki 5700000±n/a nM
Citation Innocenti, AVullo, DScozzafava, ASupuran, CT Carbonic anhydrase inhibitors. Inhibition of isozymes I, II, IV, V, and IX with anions isosteric and isoelectronic with sulfate, nitrate, and carbonate. Bioorg Med Chem Lett15:567-71 (2005) 
 
Carbonic anhydrase 4
Name:Carbonic anhydrase 4
Type:Enzyme
Mol. Mass.:35037.98
Organism:Homo sapiens (Human)
Description:P22748
Residue:312
BDBM26986
NameBDBM26986
Synonyms:CHEMBL363707 SODIUM BICARBONATE hydrogen carbonate
TypeIon
Emp. Form.CHO3
Mol. Mass.61.0174
SMILESOC([O-])=O