Reaction Details
TargetSodium-dependent serotonin transporter
LigandBDBM50160890
Substrate/Competitorn/a
Meas. Tech.ChEMBL_303219 (CHEMBL827185)
Ki 4.56±n/a nM
Citation Tamagnan, GAlagille, DFu, XKula, NSBaldessarini, RJInnis, RBBaldwin, RM Synthesis and monoamine transporter affinity of new 2beta-carbomethoxy-3beta-[4-(substituted thiophenyl)]phenyltropanes: discovery of a selective SERT antagonist with picomolar potency. Bioorg Med Chem Lett15:1131-3 (2005) 
 
Sodium-dependent serotonin transporter
Name:Sodium-dependent serotonin transporter
Type:Multi-pass membrane protein
Mol. Mass.:70168.43
Organism:Rattus norvegicus (rat)
Description:P31652
Residue:630
BDBM50160890
NameBDBM50160890
Synonyms:3-[4-(5-Iodo-thiophen-2-yl)-phenyl]-8-methyl-8-aza-bicyclo[3.2.1]octane-2-carboxylic acid methyl ester | CHEMBL178773
TypeSmall organic molecule
Emp. Form.C20H22INO2S
Mol. Mass.467.364
SMILESCOC(=O)C1C2CCC(CC1c1ccc(cc1)-c1ccc(I)s1)N2C