Reaction Details
TargetSodium-dependent serotonin transporter
LigandBDBM50160894
Substrate/Competitorn/a
Meas. Tech.ChEMBL_303219 (CHEMBL827185)
Ki 0.15±n/a nM
Citation Tamagnan, GAlagille, DFu, XKula, NSBaldessarini, RJInnis, RBBaldwin, RM Synthesis and monoamine transporter affinity of new 2beta-carbomethoxy-3beta-[4-(substituted thiophenyl)]phenyltropanes: discovery of a selective SERT antagonist with picomolar potency. Bioorg Med Chem Lett15:1131-3 (2005) 
 
Sodium-dependent serotonin transporter
Name:Sodium-dependent serotonin transporter
Type:Multi-pass membrane protein
Mol. Mass.:70168.43
Organism:Rattus norvegicus (rat)
Description:P31652
Residue:630
BDBM50160894
NameBDBM50160894
Synonyms:8-Methyl-3-(4-thiophen-2-yl-phenyl)-8-aza-bicyclo[3.2.1]octane-2-carboxylic acid methyl ester | CHEMBL181609
TypeSmall organic molecule
Emp. Form.C20H23NO2S
Mol. Mass.341.467
SMILESCOC(=O)C1C2CCC(CC1c1ccc(cc1)-c1cccs1)N2C