Reaction Details
TargetSodium-dependent serotonin transporter
LigandBDBM50010195
Substrate/Competitorn/a
Meas. Tech.ChEMBL_303219 (CHEMBL827185)
Ki 0.46±n/a nM
Citation Tamagnan, GAlagille, DFu, XKula, NSBaldessarini, RJInnis, RBBaldwin, RM Synthesis and monoamine transporter affinity of new 2beta-carbomethoxy-3beta-[4-(substituted thiophenyl)]phenyltropanes: discovery of a selective SERT antagonist with picomolar potency. Bioorg Med Chem Lett15:1131-3 (2005) 
 
Sodium-dependent serotonin transporter
Name:Sodium-dependent serotonin transporter
Type:Multi-pass membrane protein
Mol. Mass.:70168.43
Organism:Rattus norvegicus (rat)
Description:P31652
Residue:630
BDBM50010195
NameBDBM50010195
Synonyms:(3S,5R)-methyl 3-(4-iodophenyl)-8-methyl-8-aza-bicyclo[3.2.1]octane-2-carboxylate 3-(4-Iodo-phenyl)-8-methyl-8-aza-bicyclo[3.2.1]octane-2-carboxylic acid methyl ester | CHEMBL14391
TypeSmall organic molecule
Emp. Form.C16H20INO2
Mol. Mass.385.24
SMILESCOC(=O)C1C2CCC(CC1c1ccc(I)cc1)N2C