Reaction Details
TargetCarbonic anhydrase 4
LigandBDBM10865
Substrate/Competitorn/a
Meas. Tech.ChEMBL_302691 (CHEMBL838574)
Ki 125±n/a nM
Citation Innocenti, AFirnges, MAAntel, JWurl, MScozzafava, ASupuran, CT Carbonic anhydrase inhibitors. Inhibition of the membrane-bound human and bovine isozymes IV with sulfonamides. Bioorg Med Chem Lett15:1149-54 (2005) 
 
Carbonic anhydrase 4
Name:Carbonic anhydrase 4
Type:Enzyme
Mol. Mass.:35152.74
Organism:Bos taurus (bovine)
Description:Bovine isozyme, isolated from lung microsomes
Residue:312
BDBM10865
NameBDBM10865
Synonyms:4-Amino-3-iodobenzenesulfonamide CHEMBL268177 halogenosulfanilamide deriv. 5e
TypeSmall organic molecule
Emp. Form.C6H7IN2O2S
Mol. Mass.298.101
SMILESNc1ccc(cc1I)S(N)(=O)=O