Reaction Details
TargetCarbonic anhydrase 12
LigandBDBM4703
Substrate/Competitorn/a
Meas. Tech.ChEMBL_302410 (CHEMBL828815)
Ki 34±n/a nM
Citation Vullo, DInnocenti, ANishimori, IPastorek, JScozzafava, APastoreková, SSupuran, CT Carbonic anhydrase inhibitors. Inhibition of the transmembrane isozyme XII with sulfonamides-a new target for the design of antitumor and antiglaucoma drugs? Bioorg Med Chem Lett15:963-9 (2005) 
 
Carbonic anhydrase 12
Name:Carbonic anhydrase 12
Type:Enzyme
Mol. Mass.:39456.00
Organism:Homo sapiens (Human)
Description:Catalytic domain of human cloned isozyme was used in the assay
Residue:354
BDBM4703
NameBDBM4703
Synonyms:4-carboxybenzenesulfonamide 1 Benzoic Acid deriv. 31 JMC522226 Compound 22 JMC52646 Compound 23 | aromatic/heteroaromatic sulfonamide 23
TypeSmall organic molecule
Emp. Form.C7H7NO4S
Mol. Mass.201.2
SMILESNS(=O)(=O)c1ccc(cc1)C(O)=O