Reaction Details
TargetCarbonic anhydrase 2
LigandBDBM10864
Substrate/Competitorn/a
Meas. Tech.ChEMBL_302394 (CHEMBL829640)
Ki 40±n/a nM
Citation Vullo, DInnocenti, ANishimori, IPastorek, JScozzafava, APastoreková, SSupuran, CT Carbonic anhydrase inhibitors. Inhibition of the transmembrane isozyme XII with sulfonamides-a new target for the design of antitumor and antiglaucoma drugs? Bioorg Med Chem Lett15:963-9 (2005) 
 
Carbonic anhydrase 2
Name:Carbonic anhydrase 2
Type:Enzyme
Mol. Mass.:29250.71
Organism:Homo sapiens (Human)
Description:P00918
Residue:260
BDBM10864
NameBDBM10864
Synonyms:4-Amino-3-bromobenzenesulfonamide CHEMBL6724 halogenosulfanilamide deriv. 5d
TypeSmall organic molecule
Emp. Form.C6H7BrN2O2S
Mol. Mass.251.101
SMILESNc1ccc(cc1Br)S(N)(=O)=O