Reaction Details
TargetCarbonic anhydrase 2
LigandBDBM50160670
Substrate/Competitorn/a
Meas. Tech.ChEMBL_302394 (CHEMBL829640)
Ki 15±n/a nM
Citation Vullo, DInnocenti, ANishimori, IPastorek, JScozzafava, APastoreková, SSupuran, CT Carbonic anhydrase inhibitors. Inhibition of the transmembrane isozyme XII with sulfonamides-a new target for the design of antitumor and antiglaucoma drugs? Bioorg Med Chem Lett15:963-9 (2005) 
 
Carbonic anhydrase 2
Name:Carbonic anhydrase 2
Type:Enzyme
Mol. Mass.:29250.71
Organism:Homo sapiens (Human)
Description:P00918
Residue:260
BDBM50160670
NameBDBM50160670
Synonyms:CHEMBL182723 | N-(3-Chloro-1H-indol-7-yl)-4-sulfinamoyl-benzenesulfonamide
TypeSmall organic molecule
Emp. Form.C14H12ClN3O3S2
Mol. Mass.369.846
SMILESNS(=O)c1ccc(cc1)S(=O)(=O)Nc1cccc2c(Cl)c[nH]c12