Reaction Details
TargetCarbonic anhydrase 1
LigandBDBM10862
Substrate/Competitorn/a
Meas. Tech.ChEMBL_302370 (CHEMBL830339)
Ki 8300±n/a nM
Citation Vullo, DInnocenti, ANishimori, IPastorek, JScozzafava, APastoreková, SSupuran, CT Carbonic anhydrase inhibitors. Inhibition of the transmembrane isozyme XII with sulfonamides-a new target for the design of antitumor and antiglaucoma drugs? Bioorg Med Chem Lett15:963-9 (2005) 
 
Carbonic anhydrase 1
Name:Carbonic anhydrase 1
Type:Enzyme
Mol. Mass.:28873.37
Organism:Homo sapiens (Human)
Description:P00915
Residue:261
BDBM10862
NameBDBM10862
Synonyms:4-Amino-3-fluorobenzenesulfonamide CHEMBL6853 halogenosulfanilamide deriv. 5b
TypeSmall organic molecule
Emp. Form.C6H7FN2O2S
Mol. Mass.190.195
SMILESNc1ccc(cc1F)S(N)(=O)=O