Reaction Details
TargetCarbonic anhydrase 1
LigandBDBM10879
Substrate/Competitorn/a
Meas. Tech.ChEMBL_302370 (CHEMBL830339)
Ki 24000±n/a nM
Citation Vullo, DInnocenti, ANishimori, IPastorek, JScozzafava, APastoreková, SSupuran, CT Carbonic anhydrase inhibitors. Inhibition of the transmembrane isozyme XII with sulfonamides-a new target for the design of antitumor and antiglaucoma drugs? Bioorg Med Chem Lett15:963-9 (2005) 
 
Carbonic anhydrase 1
Name:Carbonic anhydrase 1
Type:Enzyme
Mol. Mass.:28873.37
Organism:Homo sapiens (Human)
Description:P00915
Residue:261
BDBM10879
NameBDBM10879
Synonyms:2-Hydrazinobenzenesulfonamide CHEMBL176495 hydrazide deriv. 18
TypeSmall organic molecule
Emp. Form.C6H9N3O2S
Mol. Mass.187.22
SMILESNNc1ccccc1S(N)(=O)=O