Reaction Details
TargetCarbonic anhydrase 7
LigandBDBM10869
Substrate/Competitorn/a
Meas. Tech.ChEMBL_302350 (CHEMBL828071)
Ki 4.3±n/a nM
Citation Vullo, DVoipio, JInnocenti, ARivera, CRanki, HScozzafava, AKaila, KSupuran, CT Carbonic anhydrase inhibitors. Inhibition of the human cytosolic isozyme VII with aromatic and heterocyclic sulfonamides. Bioorg Med Chem Lett15:971-6 (2005) 
 
Carbonic anhydrase 7
Name:Carbonic anhydrase 7
Type:Enzyme
Mol. Mass.:29664.11
Organism:Homo sapiens (Human)
Description:Human cloned isozyme.
Residue:264
BDBM10869
NameBDBM10869
Synonyms:5-imino-4-methyl-4,5-dihydro-1,3,4-thiadiazole-2-sulfonamide aromatic/heteroaromatic sulfonamide 14
TypeSmall organic molecule
Emp. Form.C3H6N4O2S2
Mol. Mass.194.235
SMILESCn1nc(sc1=N)S(N)(=O)=O