Reaction Details
TargetCarbonic anhydrase 2
LigandBDBM50160671
Substrate/Competitorn/a
Meas. Tech.ChEMBL_302349 (CHEMBL828932)
Ki 30±n/a nM
Citation Vullo, DVoipio, JInnocenti, ARivera, CRanki, HScozzafava, AKaila, KSupuran, CT Carbonic anhydrase inhibitors. Inhibition of the human cytosolic isozyme VII with aromatic and heterocyclic sulfonamides. Bioorg Med Chem Lett15:971-6 (2005) 
 
Carbonic anhydrase 2
Name:Carbonic anhydrase 2
Type:Enzyme
Mol. Mass.:29250.71
Organism:Homo sapiens (Human)
Description:P00918
Residue:260
BDBM50160671
NameBDBM50160671
Synonyms:Benzothiazole-2-sulfonic acid amide | CHEMBL168552
TypeSmall organic molecule
Emp. Form.C7H6N2O2S2
Mol. Mass.214.265
SMILESNS(=O)(=O)c1nc2ccccc2s1