Reaction Details
TargetMatrix metalloproteinase-14
LigandBDBM50082556
Substrate/Competitorn/a
Meas. Tech.ChEMBL_305766 (CHEMBL827103)
IC50 0.3±n/a nM
Citation Rossello, ANuti, ECarelli, POrlandini, EMacchia, MNencetti, SZandomeneghi, MBalzano, FUccello Barretta, GAlbini, ABenelli, RCercignani, GMurphy, GBalsamo, A N-i-Propoxy-N-biphenylsulfonylaminobutylhydroxamic acids as potent and selective inhibitors of MMP-2 and MT1-MMP. Bioorg Med Chem Lett15:1321-6 (2005) 
 
Matrix metalloproteinase-14
Name:Matrix metalloproteinase-14
Type:Protein
Mol. Mass.:65900.19
Organism:Homo sapiens (Human)
Description:P50281
Residue:582
BDBM50082556
NameBDBM50082556
Synonyms:(S)-2,2-Dimethyl-4-[4-(pyridin-4-yloxy)-benzenesulfonyl]-thiomorpholine-3-carboxylic acid hydroxyamide 2,2-Dimethyl-4-[4-(pyridin-4-yloxy)-benzenesulfonyl]-thiomorpholine-3-carboxylic acid hydroxyamide 2,2-Dimethyl-4-[4-(pyridin-4-yloxy)-benzenesulfonyl]-thiomorpholine-3-carboxylic acid hydroxyamide(prinomastat) CHEMBL75094 | Prinomastat
TypeSmall organic molecule
Emp. Form.C18H21N3O5S2
Mol. Mass.423.506
SMILESCC1(C)SCCN([C@H]1C(=O)NO)S(=O)(=O)c1ccc(Oc2ccncc2)cc1